API4KP Ontology of Known Platform Components
type: Ontology
abstract: This ontology provides example descriptions of the kinds of platform elements that might be needed in an application environment.
contributor: Elisa Kendall (ekendall at thematix.com)
creator: Davide Sottara (sottara.davide at mayo.edu)
license: http://opensource.org/licenses/MIT
imports: api4kp-kp
imports: api4kp
imports: AnnotationVocabulary
version IRI: api4kp-kpc
change note: The https://www.omg.org/spec/API4KP/20210201/api4kp-kpc.rdf version of this ontology was modified to leverage the Commons Ontology Library (API4KP-22), including replacement of references to Specification Metadata and references to LCC with the Commons Annotation Vocabulary and other Commons ontologies, and to reduce the dependency on DOL as appropriate.
copyright: Copyright (c) 2014-2023 Athan Services
copyright: Copyright (c) 2014-2023 Fraunhofer Gesellschaft
copyright: Copyright (c) 2014-2023 Freie Universität Berlin
copyright: Copyright (c) 2014-2023 Mayo Foundation for Medical Education and Research (MFMER)
copyright: Copyright (c) 2014-2023 Raytheon Technologies
copyright: Copyright (c) 2014-2023 Thematix Partners LLC
copyright: Copyright (c) 2015-2023 Object Management Group, Inc.
copyright: Copyright (c) 2019-2023 Universität Leipzig
copyright: Copyright (c) 2020-2023 Micro Focus

Drools
type: Class
subclass of: ProductionRuleEngine
definition: production rules engine that provides a core business rules engine (BRE), a web authoring and rules management application (Drools Workbench), full runtime support for Decision Model and Notation (DMN) models at conformance level 3 and an Eclipse IDE plugin for core development

Drools 5.6
type: NamedIndividual
type: Drools

Drools 7.48.0.Final
type: NamedIndividual
type: Drools
definition: Drools production release dated 2021-01-13

HermiT
type: Class
subclass of: DescriptionLogicReasoner
definition: description logic reasoner that is designed to support ontologies written using the Web Ontology Language (OWL)

HermiT 1.3.8.413
type: NamedIndividual
type: HermiT
definition: HermiT production release 1.3.8.413