Commons Quantities and Units Ontology
type: Ontology
abstract: This ontology provides a core set of concepts for quantities, units, systems of quantities, and systems of units. The most widely accepted, scrutinized, and globally used system of quantities and system of units are the International System of Quantities (ISQ) and the International System of Units (SI). They are formally standardized through [ISO 31] and [IEC 60027]. The harmonization of these two sets of standards into one new set [ISO/IEC 80000] has been published by ISO in 2009 and 2010. This ontology is based on the Object Management Group (OMG)'s SysML standard and on ISO/IEC 80000-1:2009, which refers normatively to the ISO/IEC Guide 99:2007. It is compatible with and can be mapped directly to the OMG Date Time Vocabulary (DTV) Quantities Ontology, the de-facto QUDT ontology representing Units of Measure, Quantity Kinds, Dimensions and Data Types (see http://www.qudt.org/), the Units of Measurement Ontology (UO) ontology available from the BioPortal (https://bioportal.bioontology.org/ontologies/UO) and others, as well as the quantities and units library in the SysML specification.
contributor: Davide Sottara, Mayo Clinic
contributor: Elisa Kendall, Thematix Partners LLC
contributor: Evan Wallace, U.S. National Institute of Standards and Technology (NIST)
contributor: Hans Peter de Koning, DEKonsult
contributor: Jim Logan, Ontogenesis Solutions, LLC
contributor: Michel Sauvage, Airbus Group
contributor: Roger Burkhart, Thematix Partners LLC
contributor: Steve Jenkins, Jet Propulsion Laboratory (JPL), California Institute of Technology, National Aeronautics and Space Administration (NASA)
contributor: Stuart Chalk, University of North Florida
contributor: Thomas Barre, Airbus Group
license: Copyright (c) 2011-2024 Thematix Partners LLC Copyright (c) 2015-2024 EDM Council, Inc. Copyright (c) 2015-2024 Object Management Group, Inc. Copyright (c) 2023-2024 DEKonsult Copyright (c) 2023-2024 Mayo Clinic Copyright (c) 2023-2024 University of North Florida Copyright (c) 2024 Airbus Group Copyright (c) 2024 Ontogenesis Solutions, LLC Permission is hereby granted, free of charge, to any person obtaining a copy of this software and associated documentation files (the 'Software'), to deal in the Software without restriction, including without limitation the rights to use, copy, modify, merge, publish, distribute, sublicense, and/or sell copies of the Software, and to permit persons to whom the Software is furnished to do so, subject to the following conditions: The above copyright notice and this permission notice shall be included in all copies or substantial portions of the Software. THE SOFTWARE IS PROVIDED 'AS IS', WITHOUT WARRANTY OF ANY KIND, EXPRESS OR IMPLIED, INCLUDING BUT NOT LIMITED TO THE WARRANTIES OF MERCHANTABILITY, FITNESS FOR A PARTICULAR PURPOSE AND NONINFRINGEMENT. IN NO EVENT SHALL THE AUTHORS OR COPYRIGHT HOLDERS BE LIABLE FOR ANY CLAIM, DAMAGES OR OTHER LIABILITY, WHETHER IN AN ACTION OF CONTRACT, TORT OR OTHERWISE, ARISING FROM, OUT OF OR IN CONNECTION WITH THE SOFTWARE OR THE USE OR OTHER DEALINGS IN THE SOFTWARE. See https://opensource.org/licenses/MIT.
imports: AnnotationVocabulary
imports: Classifiers
imports: Collections
imports: ContextualDesignators
imports: Designators
imports: Documents
version IRI: QuantitiesAndUnits
change note: The https://www.omg.org/spec/Commons/20230801/QuantitiesAndUnits.rdf version of this ontology was modified to loosen functional constraints on a number of properties, which caused reasoning errors when these generic properties were reused with multiple subproperties on the same concept and eliminate potentially circular restrictions (Commons-1.2-5) and to add the concept of a measurement reference to enable better alignment of such references with quantity values whose reference is something other than a unit of measure (Commons-1.2-3).
copyright: Copyright (c) 2011-2024 Thematix Partners LLC
copyright: Copyright (c) 2015-2024 EDM Council, Inc.
copyright: Copyright (c) 2015-2024 Object Management Group, Inc.
copyright: Copyright (c) 2023-2024 DEKonsult
copyright: Copyright (c) 2023-2024 Mayo Clinic
copyright: Copyright (c) 2023-2024 University of North Florida
copyright: Copyright (c) 2024 Airbus Group
copyright: Copyright (c) 2024 Ontogenesis Solutions, LLC

arbitrary unit
type: Class
subclass of: measurement unit
subclass of: Restriction
  on property: refersTo
  on class: material measure
  min qualified cardinality: 0
subclass of: Restriction
  on property: refersTo
  on class: measurement procedure
  min qualified cardinality: 0
subclass of: Restriction
  on property: refersTo
  on class: reference material
  min qualified cardinality: 0
source: ISO 11240 Health informatics - Identification of medicinal products - Data elements and structures for the unique identification and exchange of units of measurement, clause 3.1.1
disjoint with: physical unit
definition: arbitrarily defined unit of measurement, where a relation of the unit to a physical unit of the SI does not exist or is unknown
note: Arbitrary units represent references to materials or procedures that are defined outside of the SI system. A quantity value is arbitrarily assigned to the reference preparation or the result of a measurement procedure, usually specific for a particular substance. This generally precludes comparability of quantity values across different systems and components for this type of units.

base quantity kind
type: Class
subclass of: quantity kind
subclass of: Restriction
  on property: isDefinedIn
  on class: system of quantities
  qualified cardinality: 1
source: ISO 11240 Health informatics - Identification of medicinal products - Data elements and structures for the unique identification and exchange of units of measurement, clause 3.1.2
source: ISO 80000-1:2009 Quantities and units - Part 1: General, clause 3.4
source: https://www.omg.org/spec/SysML/
definition: quantity in a conventionally chosen subset of a given system of quantities, where no quantity in the subset can be expressed in terms of the other quantities within that subset
example: The International System of Quantities (ISQ) comprises these base quantities (with their SI base measurement units): length (meter), mass (kilogram), duration (second), electric current (ampere), thermodynamic temperature (kelvin), amount of substance (mole), and luminous intensity (candela). These base quantities are not mutually comparable. All quantities of any one of these kinds are, however, mutually comparable.
note: The subset mentioned in the definition is termed the 'set of base quantities'. Base quantities are referred to as being mutually independent since a base quantity cannot be expressed as a product of powers of the other base quantities.
synonym: base quantity
synonym: simple quantity kind

base unit
type: Class
subclass of: physical unit
source: ISO 11240 Health informatics - Identification of medicinal products - Data elements and structures for the unique identification and exchange of units of measurement, clause 3.1.3
source: ISO 80000-1:2009 Quantities and units - Part 1: General, clause 3.10
source: https://www.omg.org/spec/SysML/
definition: measurement unit that is defined by a system of units to be the reference measurement unit for a base quantity
example: In the SI, the meter is the base unit of length. In the CGS systems, the centimeter is the base unit of length.
note: In each coherent system of units, there is only one base unit for each base quantity. A base unit may also serve for a derived quantity of the same quantity dimension.
synonym: simple unit

coherent derived unit
type: Class
subclass of: derived unit
source: ISO 11240 Health informatics - Identification of medicinal products - Data elements and structures for the unique identification and exchange of units of measurement, clause 3.1.4
source: ISO 80000-1:2009 Quantities and units - Part 1: General, clause 3.12
definition: derived unit that, for a given system of quantities and for a chosen set of base units, is a product of powers of base units with no other proportionality factor than one
example: If the meter, the second, and the mole are base units, the mole per cubic meter is the coherent derived unit of amount-of-substance concentration when amount-of-substance concentration is defined by the quantity equation c = n/V. The kilometer per hour and the knot, given as examples of derived units, are not coherent derived units in such a system of quantities.
note: A power of a base unit is the base unit raised to an exponent. Coherence can be determined only with respect to a particular system of quantities and a given set of base units.

constant
type: Class
subclass of: scalar quantity value
definition: symbol that represents a value that does not change (i.e., is fixed) with respect to a formula or expression

conversion-based unit
type: Class
subclass of: derived unit
subclass of: Restriction
  on property: has expression
  on class: expression
  min qualified cardinality: 0
source: https://www.omg.org/spec/SysML/
definition: derived unit that is defined with respect to another reference unit through an explicit conversion relationship

conversion factor between units
type: Class
subclass of: factor
subclass of: ratio
subclass of: Restriction
  on property: has quantity kind
  on class: quantity kind
  qualified cardinality: 1
source: ISO 11240 Health informatics - Identification of medicinal products - Data elements and structures for the unique identification and exchange of units of measurement, clause 3.1.6
source: ISO 80000-1:2009 Quantities and units - Part 1: General, clause 3.24
definition: ratio of two measurement units for quantities of the same kind

cyclic ratio scale
type: Class
subclass of: ratio scale
source: https://www.omg.org/spec/SysML/
definition: measurement scale that represents a ratio scale with a periodic cycle
example: 'cyclic degree' (to express planar angular measures) with modulus = 360 and unit 'degree'
example: 'hour of day' with modulus = 24 and unit 'hour'

derived quantity kind
type: Class
subclass of: quantity kind
subclass of: Restriction
  on property: has factor
  on class: quantity kind power factor
  min qualified cardinality: 0
subclass of: Restriction
  on property: is derived from
  some values from: quantity kind
source: ISO 11240 Health informatics - Identification of medicinal products - Data elements and structures for the unique identification and exchange of units of measurement, clause 3.1.7
source: ISO 80000-1:2009 Quantities and units - Part 1: General, clause 3.5
source: https://www.omg.org/spec/SysML/
disjoint with: base quantity kind
definition: quantity, in a system of quantities, defined in terms of the base quantities of that system
example: In a system of quantities having the base quantities length and mass, mass density is a derived quantity defined as the quotient of mass and volume (length to the power three).

derived unit
type: Class
subclass of: physical unit
subclass of: Restriction
  on property: has factor
  on class: unit power factor
  min qualified cardinality: 0
subclass of: Restriction
  on property: is derived from
  some values from: base unit
source: ISO 11240 Health informatics - Identification of medicinal products - Data elements and structures for the unique identification and exchange of units of measurement, clause 3.1.8
source: ISO 80000-1:2009 Quantities and units - Part 1: General, clause 3.11
source: https://www.omg.org/spec/SysML/
definition: measurement unit for a derived quantity, i.e., one that is defined with respect to one or more base units, such as as a product of powers of one or more other measurement units
example: The meter per second, symbol m/s, and the centimeter per second, symbol cm/s, are derived units of speed in the SI. The kilometer per hour, symbol km/h, is a measurement unit of speed outside the SI but accepted for use with the SI. The knot, equal to one nautical mile per hour, is a measurement unit of speed outside the SI.

dimensionless quantity
type: Class
subclass of: quantity kind
source: ISO 11240 Health informatics - Identification of medicinal products - Data elements and structures for the unique identification and exchange of units of measurement, clause 3.1.10
source: ISO 80000-1:2009 Quantities and units - Part 1: General, clause 3.8
source: https://www.omg.org/spec/SysML/
definition: quantity for which all the exponents of the factors corresponding to the base quantities in its quantity dimension are zero
example: Plane angle, solid angle, refractive index, relative permeability, mass fraction, friction factor, Mach number
note: Some quantities of dimension one are defined as the ratios of two quantities of the same kind. The coherent derived unit is the number one, symbol 1.
note: The measurement units and values of quantities of dimension one are numbers, but such quantities convey more information than a number.
note: The term 'dimensionless quantity' is commonly used and is included for historical reasons. It stems from the fact that all exponents are zero in the symbolic representation of the dimension for such quantities. The term 'quantity of dimension one' reflects the convention in which the symbolic representation of the dimension for such quantities is the symbol 1. This dimension is not a number, but the neutral element for multiplication of dimensions.
synonym: quantity of dimension one

expression
type: Class
subclass of: Restriction
  on property: has argument
  on class: constant
  min qualified cardinality: 0
subclass of: Restriction
  on property: has argument
  on class: variable
  min qualified cardinality: 0
definition: finite combination of symbols that are well-formed according to applicable rules

factor
type: Class
subclass of: Aspect
definition: number or quantity that when multiplied with another produces a given number or expression

International System of Quantities
type: NamedIndividual
type: system of quantities
source: ISO 80000-1:2009 Quantities and units - Part 1: General, clause 3.6
definition: system of quantities based on the seven base quantities: length, mass, time, electric current, thermodynamic temperature, amount of substance, and luminous intensity
note: The International System of Units (SI) is based on the ISQ.
note: This system of quantities is published in the ISO 80000 and IEC 80000 series Quantities and units, Parts 3 to 14.
abbreviation: ISQ

International System of Units
type: NamedIndividual
type: system of units
source: ISO 80000-1:2009 Quantities and units - Part 1: General, clause 3.16
definition: system of units, based on the International System of Quantities, their names and symbols, including a series of prefixes and their names and symbols, together with rules for their use, adopted by the General Conference on Weights and Measures (CGPM)
note: The SI is founded on the seven base quantities of the ISQ and the names and symbols of the corresponding base units. The base units and the coherent derived units of the SI form a coherent set, designated the 'set of coherent SI units'.
abbreviation: SI
complies with: International System of Quantities

interval scale
type: Class
subclass of: measurement scale
source: https://plato.stanford.edu/entries/measurement-science/
source: https://www.omg.org/spec/SysML/
source: https://www.statista.com/statistics-glossary/definition/320/interval_scale/
definition: measurement scale that represents quantitative values and for which mode, median and mean can be calculated
example: Celsius and Fahrenheit are examples of interval scales: they represent equality or inequality among intervals of temperature, but not ratios of temperature, because their zero points are arbitrary. Rating scales, where it is assumed that the distances between the single expressions of evaluation (score) are equal, are also interval scales with no natural zero point.
note: Linear interval scales allow both multiplication by a positive number and a constant shift, e.g., the conversion from Celsius to Fahrenheit.

logarithmic scale
type: Class
subclass of: measurement scale
source: https://en.wikipedia.org/wiki/Logarithmic_scale/
source: https://plato.stanford.edu/entries/measurement-science/
source: https://www.omg.org/spec/SysML/
definition: measurement scale on which the actual distance of a point from the scale's zero is proportional to the logarithm of the corresponding scale number rather than to the number itself
example: A logarithmic scale (or log scale) is a way of displaying numerical data over a very wide range of values in a compact way - typically the largest numbers in the data are hundreds or even thousands of times larger than the smallest numbers. Such a scale is nonlinear: the numbers 10 and 20, and 60 and 70, are not the same distance apart on a log scale. Rather, the numbers 10 and 100, and 60 and 600 are equally spaced. Thus moving a unit of distance along the scale means the number has been multiplied by 10 (or some other fixed factor).

material measure
type: Class
subclass of: measure
source: ISO 11240 Health informatics - Identification of medicinal products - Data elements and structures for the unique identification and exchange of units of measurement, clause 3.1.14
definition: something that reproduces or supplies one or more quantities, each with an assigned quantity value
example: Ruler, standard weight, volume measure

measure
type: Class
source: https://stats.oecd.org/glossary/detail.asp
definition: amount or degree of something; the dimensions, capacity, or amount of something ascertained by measuring
note: Measure refers to the phenomenon or phenomena to be measured in a data set. In a data set, the instance of a measure is often called an observation.

measurement procedure
type: Class
subclass of: measurement reference
definition: procedure of a measurement according to one or more measurement principles (i.e. phenomena, observables) and a given measurement method, based on a measurement model and including any calculation to obtain a measurement result
example: Lowering of the concentration of glucose in blood in a fasting rabbit is an observable that can be applied to the measurement of insulin concentration in a preparation. Together with a description of the measurement method this can be used to define a measurement procedure.
note: A measurement procedure can include a statement concerning a target measurement uncertainty.
note: A measurement procedure is usually documented in sufficient detail to enable an operator to perform a measurement.
abbreviation: SOP
adapted from: ISO 11240 Health informatics - Identification of medicinal products - Data elements and structures for the unique identification and exchange of units of measurement, clause 3.1.16
synonym: standard operating procedure

measurement reference
type: Class
subclass of: Reference
subclass of: Class
  union of: measurement procedure
  union of: measurement unit
  union of: reference material
  union of: measurement scale
definition: measurement unit, measurement procedure, reference material, or a combination of such
note: Note that the concept of a measurement reference is currently not defined in terms and definitions in the VIM standard, but rather in Note 2 on quantity.
adapted from: International Vocabulary of Metrology - Basic and General Concepts and Associated Terms (VIM), Third Edition, JCGM 200:2012, available at https://www.bipm.org/documents/20126/2071204/JCGM_200_2012.pdf

measurement scale
type: Class
subclass of: ClassificationScheme
subclass of: measurement reference
subclass of: Restriction
  on property: has maximum permissive value
  on class: scalar quantity value
  min qualified cardinality: 0
subclass of: Restriction
  on property: has minimum permissive value
  on class: scalar quantity value
  min qualified cardinality: 0
subclass of: Restriction
  on property: is maximum inclusive
  min qualified cardinality: 0
  on data range: boolean
subclass of: Restriction
  on property: is minimum inclusive
  min qualified cardinality: 0
  on data range: boolean
subclass of: Restriction
  on property: classifies
  some values from: measurement unit
source: ISO 80000-1:2009 Quantities and units - Part 1: General, clause 3.27
source: https://plato.stanford.edu/entries/measurement-science/
source: https://www.omg.org/spec/SysML/
definition: ordered set of quantity values of quantities of a given kind of quantity used in ranking, according to magnitude, quantities of that kind
note: Note that the majority of scalar quantities can be expressed by just using a MeasurementUnit directly as its measurement reference. This implies expression of a scalar quantity value on a ratio scale. However, for full coverage of all quantity value expressions, additional explicit measurement scales with additional semantics are needed, such as ordinal scale, interval scale, ratio scale with additional limit values, cyclic ratio scale and logarithmic scale.
synonym: quantity-value scale

measurement unit
type: Class
subclass of: measurement reference
subclass of: scalar quantity
subclass of: Restriction
  on property: specializes
  on class: measurement unit
  min qualified cardinality: 0
subclass of: Restriction
  on property: isDefinedIn
  on class: system of units
  min qualified cardinality: 0
subclass of: Restriction
  on property: has factor
  on class: unit power factor
  min qualified cardinality: 0
source: ISO 11240 Health informatics - Identification of medicinal products - Data elements and structures for the unique identification and exchange of units of measurement, clause 3.1.33
source: ISO 80000-1:2009 Quantities and units - Part 1: General, clause 3.9
source: https://www.omg.org/spec/SysML/
definition: real scalar quantity, defined and adopted by convention, with which any other quantity of the same kind can be compared to express the ratio of the second quantity to the first one as a number
example: week, day, hour, minute, second, kilogram, joule, meter
note: A Unit is a quantity in terms of which the magnitudes of other quantities that have the same quantity kind can be stated. A unit often relies on precise and reproducible ways to measure the unit. For example, a unit of length such as meter may be specified as a multiple of a particular wavelength of light. A unit may also specify less stable or precise ways to express some value, such as a cost expressed in some currency, or a severity rating measured by a numerical scale.
note: Depending on the nature of the reference scale, the unit of measurement expression may stand either for a physical unit of measurement that is related to a system of quantities (e.g. SI units) or for an arbitrarily defined unit of measurement, which may refer to a certain reference material, a standard measurement procedure, a material measure or even to a combination of those.
note: For a given quantity, the short term 'unit' is often combined with the quantity name, such as 'mass unit' or 'unit of mass'.
note: Measurement units are designated by conventionally assigned names and symbols.
note: Measurement units of quantities of dimension one are numbers. In some cases, these measurement units are given special names, e.g. radian, steradian, and decibel, or are expressed by quotients such as millimole per mole equal to 10 to the power minus 3 and microgram per kilogram equal to 10 to the power minus 9.
note: Measurement units of quantities of the same quantity dimension may be designated by the same name and symbol even when the quantities are not of the same kind. For example, joule per kelvin and J/K are respectively the name and symbol of both a measurement unit of heat capacity and a measurement unit of entropy, which are generally not considered to be quantities of the same kind. However, in some cases special measurement unit names are restricted to be used with quantities of specific kind only. For example, the measurement unit 'second to the power minus one' (1/s) is called hertz (Hz) when used for frequencies and becquerel (Bq) when used for activities of radionuclides. As another example, the joule (J) is used as a unit of energy, but never as a unit of moment of force, i.e. the newton meter (N m).
synonym: unit of measurement

nominal scale
type: Class
subclass of: measurement scale
source: https://plato.stanford.edu/entries/measurement-science/
source: https://www.ncbi.nlm.nih.gov/pmc/articles/PMC4589638/
definition: measurement scale that represents objects as belonging to classes that have no particular order
example: Many nominal scales are qualitative in nature. A common example of a nominal scale is that of gender identity, which is a way of describing one's persistent inner concept of their gender. While the terminology from a psychological and medical perspective continues to evolve, the scale covers individuals who self identify as male or female as well as those that have a less determinant perspective, such as transsexual or non-binary.

ordinal scale
type: Class
subclass of: measurement scale
source: ISO 80000-1:2009 Quantities and units - Part 1: General, clause 3.28
source: https://plato.stanford.edu/entries/measurement-science/
source: https://www.omg.org/spec/SysML/
definition: quantity-value scale for ordinal quantities, i.e., one that represents order but no further algebraic structure
example: For example, the Mohs scale of mineral hardness represents minerals with numbers ranging from 1 (softest) to 10 (hardest), but there is no empirical significance to equality among intervals or ratios of those numbers.
note: An ordinal quantity-value scale may be established by measurements according to a measurement procedure.
note: Ordinal scales allow any transformation function as long as it is monotonic and increasing.
synonym: ordinal quantity-value scale
synonym: ordinal value scale

percentage
type: Class
subclass of: ratio
definition: ratio value expressed as a fraction of 100, i.e., in which the denominator is fixed rather than variable and equal to 100
note: The percent value is computed by multiplying the numeric value of the ratio by 100.
note: While many percentage values are between 0 and 100, there is no mathematical restriction and percentages may take on other values (positive or negative), particularly in the case of comparisons (percent change).

physical unit
type: Class
subclass of: measurement unit
subclass of: Restriction
  on property: isDefinedIn
  some values from: system of units
source: ISO 11240 Health informatics - Identification of medicinal products - Data elements and structures for the unique identification and exchange of units of measurement, clause 3.1.21
definition: unit of measurement that is defined using a physical quantity
note: Its definition relates measured quantities to the base quantities through a set of well-defined equations.
note: Physical units and their related scales are defined independently of the measurement procedure and the measured components. They relate to an internationally standardized system of units and equations governing the mathematical relations between those units.
synonym: physical unit of measurement

prefix
type: Class
subclass of: factor
subclass of: Restriction
  on property: has factor value
  on data range: rational
  qualified cardinality: 1
source: ISO 11240 Health informatics - Identification of medicinal products - Data elements and structures for the unique identification and exchange of units of measurement, clause 3.1.22
definition: named multiple or sub-multiple multiplication factor used in the specification of a derived unit
note: A prefix is a word or symbol for attachment to the name or symbol of a unit in order to form units that are multiples or sub-multiples of that unit.
note: A system of units may specify a set of prefixes.

prefixed unit
type: Class
subclass of: conversion-based unit
subclass of: Restriction
  on property: has factor
  some values from: prefix
source: https://www.omg.org/spec/SysML/
definition: conversion-based unit that is defined with respect to another measurement reference unit through a linear conversion relationship with a named prefix that represents a multiple or submultiple of a unit

quantity dimension
type: Class
subclass of: Classifier
subclass of: Restriction
  on property: has factor
  on class: quantity kind power factor
  min qualified cardinality: 0
source: ISO 11240 Health informatics - Identification of medicinal products - Data elements and structures for the unique identification and exchange of units of measurement, clause 3.1.9
source: ISO 80000-1:2009 Quantities and units - Part 1: General, clause 3.7
source: https://www.omg.org/spec/SysML/
definition: expression of the dependence of a quantity on the base quantities of a system of quantities as a product of powers of factors corresponding to the base quantities, omitting any numerical factor
note: A power of a factor is the factor raised to an exponent. Each factor is the dimension of a base quantity.
note: In a given system of quantities, - quantities of the same kind have the same quantity dimension, - quantities of different quantity dimensions are always of different kinds, and - quantities having the same quantity dimension are not necessarily of the same kind.
note: In deriving the dimension of a quantity, no account is taken of its scalar, vector, or tensor character.
note: The conventional symbolic representation of the dimension of a base quantity is a single upper case letter in roman (upright) type. The conventional symbolic representation of the dimension of a derived quantity is the product of powers of the dimensions of the base quantities according to the definition of the derived quantity. The dimension of a quantity Q is denoted by dim Q.
synonym: dimension
synonym: dimension of a quantity

quantity kind
type: Class
subclass of: Classifier
subclass of: Restriction
  on property: has measurement unit
  on class: measurement unit
  min qualified cardinality: 0
subclass of: Restriction
  on property: specializes
  on class: quantity kind
  min qualified cardinality: 0
subclass of: Restriction
  on property: isDefinedIn
  on class: system of quantities
  min qualified cardinality: 0
subclass of: Restriction
  on property: has dimension
  on class: quantity dimension
  qualified cardinality: 1
source: ISO 11240 Health informatics - Identification of medicinal products - Data elements and structures for the unique identification and exchange of units of measurement, clause 3.1.12
source: ISO 80000-1:2009 Quantities and units - Part 1: General, clause 3.2
source: https://www.omg.org/spec/SysML/
definition: aspect common to mutually comparable quantities
example: The quantities diameter, circumference, and wavelength are generally considered to be quantities of the same kind, namely, of the kind of quantity called length.
example: The quantities heat, kinetic energy, and potential energy are generally considered to be quantities of the same kind, namely, of the kind of quantity called energy.
example: The quantities moment of force and energy are, by convention, not regarded as being of the same kind, although they have the same dimension. Similarly for heat capacity and entropy, as well as for number of entities, relative permeability, and mass fraction.
note: Quantities of the same kind within a given system of quantities have the same quantity dimension. However, quantities of the same dimension are not necessarily of the same kind.
synonym: kind of quantity

quantity kind power factor
type: Class
subclass of: factor
subclass of: Restriction
  on property: has exponent
  on data range: rational
  qualified cardinality: 1
subclass of: Restriction
  on property: has quantity kind
  some values from: quantity kind
source: https://www.omg.org/spec/SysML/
definition: factor in a product of powers that defines a derived quantity

quantity name
type: Class
subclass of: ContextualName
subclass of: Restriction
  on property: isApplicableIn
  on class: system of quantities
  min qualified cardinality: 0
subclass of: Restriction
  on property: isApplicableIn
  on class: system of units
  min qualified cardinality: 0
subclass of: Restriction
  on property: isNameOf
  some values from: scalar quantity
definition: human-readable textual representation of the quantity
note: A number of systems of quantities and units encode a quantity, such as a unit of measure, via a generally accepted abbreviation. URIs representing such quantities are very useful in applications that require globally unique, machine readable names, but are less accessible to people. This concept is intended to provide the corresponding name for a given quantity in the context of a specific system of quantities and units for human consumption.

ratio
type: Class
subclass of: expression
subclass of: Restriction
  on property: has denominator
  on class: scalar quantity value
  qualified cardinality: 1
subclass of: Restriction
  on property: has numerator
  on class: scalar quantity value
  qualified cardinality: 1
source: https://stats.oecd.org/glossary/detail.asp
source: https://www150.statcan.gc.ca/n1/edu/power-pouvoir/glossary-glossaire/5214842-eng.htm#r
definition: proportional relationship between two different quantity values that gives rise to a datum of a specific quantity kind
note: A ratio is a quantity measured with respect to some other quantity, or in mathematics a quotient of two numbers or expressions, arrived at by dividing one by the other.
synonym: rate

ratio scale
type: Class
subclass of: measurement scale
source: https://plato.stanford.edu/entries/measurement-science/
source: https://www.omg.org/spec/SysML/
definition: measurement scale that represents quantitative values, allows comparison of differences in values, has a fixed zero value and is invariant under multiplication by a positive number
example: The Kelvin scale is a ratio scale, as are the familiar scales representing mass in kilograms, length in meters and duration in seconds.

ratio scale with additional limit values
type: Class
subclass of: ratio scale
source: https://www.omg.org/spec/SysML/
definition: measurement scale that that represents a ratio scale that has additional limit values

reference material
type: Class
subclass of: measurement reference
source: ISO 11240 Health informatics - Identification of medicinal products - Data elements and structures for the unique identification and exchange of units of measurement, clause 3.1.26
definition: material, sufficiently homogeneous and stable with reference to specified properties, which has been established to be fit for its intended use in measurement or in examination of nominal properties
note: Some reference materials have assigned quantity values that are metrologically traceable to a measurement unit outside a system of units. Such materials include vaccines to which International Units (IU) have been assigned by the World Health Organization (WHO).

scalar quantity
type: Class
subclass of: Restriction
  on property: hasName
  on class: quantity name
  min qualified cardinality: 0
subclass of: Restriction
  on property: has quantity kind
  some values from: quantity kind
source: ISO 11240 Health informatics - Identification of medicinal products - Data elements and structures for the unique identification and exchange of units of measurement, clause 3.1.24
source: ISO 80000-1:2009 Quantities and units - Part 1: General, clause 3.1
source: https://www.omg.org/spec/SysML/
definition: property of a phenomenon, body, or substance, where the property has a magnitude that can be expressed by means of a number and a reference
example: second, kilogram, joule, meter
note: A quantity as defined in ISO 80000 is a scalar. However, a vector or a tensor, the components of which are quantities, is also considered to be a quantity.
note: A reference can be a measurement unit, a measurement procedure, a reference material, or a combination of such.

scalar quantity value
type: Class
subclass of: Restriction
  on property: expresses the magnitude of
  on class: scalar quantity
  min qualified cardinality: 0
subclass of: Restriction
  on property: has numeric value
  on data range: decimal
  qualified cardinality: 1
subclass of: Restriction
  on property: has measurement reference
  some values from: measurement reference
source: ISO 11240 Health informatics - Identification of medicinal products - Data elements and structures for the unique identification and exchange of units of measurement, clauses 3.1.19, 3.1.25
source: ISO 80000-1:2009 Quantities and units - Part 1: General, clause 3.19
source: https://www.omg.org/spec/SysML/
definition: number and reference together expressing the magnitude of a quantity
note: According to the type of reference, a quantity value is either - a product of a number and a measurement unit; the measurement unit one is generally not indicated for quantities of dimension one, or - a number and a reference to a measurement procedure, or - a number and a reference material.
synonym: measurement
synonym: value of a quantity

scalar quantity value range
type: Class
subclass of: expression
subclass of: Restriction
  on property: has lower bound
  on class: scalar quantity value
  max qualified cardinality: 1
subclass of: Restriction
  on property: has upper bound
  on class: scalar quantity value
  max qualified cardinality: 1
definition: expression of the lowest possible value and/or highest possible value for some scalar quantity

system of quantities
type: Class
subclass of: ClassificationScheme
source: ISO 11240 Health informatics - Identification of medicinal products - Data elements and structures for the unique identification and exchange of units of measurement, clause 3.1.29
source: ISO 80000-1:2009 Quantities and units - Part 1: General, clause 3.3
source: https://www.omg.org/spec/SysML/
definition: set of quantities together with a set of non-contradictory equations relating those quantities
example: The International System of Quantities (ISQ) is an example of a SystemOfQuantities, defined in ISO 31 and ISO/IEC 80000.
note: Ordinal quantities, such as Rockwell C hardness, and nominal properties, such as color of light, are usually not considered to be part of a system of quantities because they are related to other quantities through empirical relations only.

system of units
type: Class
subclass of: ClassificationScheme
source: ISO 11240 Health informatics - Identification of medicinal products - Data elements and structures for the unique identification and exchange of units of measurement, clause 3.1.30
source: ISO 80000-1:2009 Quantities and units - Part 1: General, clause 3.13
source: https://www.omg.org/spec/SysML/
definition: set of base units and derived units, together with their multiples and submultiples, defined in accordance with given rules, for a given system of quantities

total
type: Class
subclass of: expression
definition: sum of the values for some characteristic of all units

unit power factor
type: Class
subclass of: factor
subclass of: Restriction
  on property: has measurement unit
  on class: measurement unit
  qualified cardinality: 1
subclass of: Restriction
  on property: has exponent
  on data range: rational
  qualified cardinality: 1
source: https://www.omg.org/spec/SysML/
definition: factor in a product of powers that defines a derived unit

variable
type: Class
subclass of: scalar quantity value
definition: symbol that represents a parameter in a formula or expression

describes actual expression
type: DatatypeProperty
sub property of: hasDescription
definition: specifies the calculation or expression used to determine the value of something
note: In cases where some expression can only be calculated in SPARQL or via rules, this property is useful for stating what that calculation should be using the input arguments to the expression.

expresses the magnitude of
type: ObjectProperty
range: scalar quantity
definition: specifies the quantity that some quantity value reflects

has argument
type: ObjectProperty
range: Class
  union of: scalar quantity value
  union of: scalar quantity value range
definition: indicates a specific input to a function, formula or expression, also known as an independent variable
scope note: Note that this property and its subproperties apply in the context of quantities and units as well as statistical measures. They are not intended to support more general mathematics.

has denominator
type: ObjectProperty
sub property of: has argument
range: Class
  union of: scalar quantity value
  union of: scalar quantity value range
definition: specifies the quantity value that is the part of a fraction 'below the line' and signifies the value by which the numerator should be divided
note: If a fraction is considered as an ordered pair, the denominator is the second argument of the fraction.

has dimension
type: ObjectProperty
sub property of: isClassifiedBy
domain: quantity kind
range: quantity dimension
definition: indicates a measurable extent associated with a given quantity kind in some system of quantities, which may be derived, depending on the choice of base quantity

has exponent
type: DatatypeProperty
range: rational
definition: indicates the number of times a number should be multiplied by itself

has expression
type: ObjectProperty
range: expression
definition: specifies a finite combination of symbols, including constants, variables that may be ordered via one or more operators, that is well-formed according to rules that depend on the language and context

has factor
type: ObjectProperty
sub property of: has argument
definition: indicates a number or quantity that when multiplied with another produces a given number or expression

has factor value
type: DatatypeProperty
range: rational
definition: indicates the numeric multiple or submultiple multiplication factor

has lower bound
type: ObjectProperty
sub property of: has argument
sub property of: has quantity value
range: scalar quantity value
definition: specifies the quantity value that is the lower value of a pair of values representing a range

has maximum permissive value
type: ObjectProperty
sub property of: has quantity value
domain: measurement scale
range: scalar quantity value
definition: indicates the maximum allowed value for a measurement on the given scale

has measurement reference
type: ObjectProperty
range: measurement reference
definition: indicates the reference against which a quantity can be expressed with respect to a number

has measurement unit
type: ObjectProperty
sub property of: has measurement reference
range: measurement unit
definition: indicates the unit against which a quantity can be expressed in a quantity value

has minimum permissive value
type: ObjectProperty
sub property of: has quantity value
domain: measurement scale
range: scalar quantity value
definition: indicates the minimum allowed value for a measurement on the given scale

has numerator
type: ObjectProperty
sub property of: has argument
range: Class
  union of: scalar quantity value
  union of: scalar quantity value range
definition: specifies the quantity value that is the part of a fraction 'above the line' and signifies the value to be divided by the denominator
note: If a fraction is considered as an ordered pair, the numerator is the first argument of the fraction.

has numeric value
type: DatatypeProperty
source: https://www.omg.org/spec/SysML/
range: decimal
definition: indicates a particular magnitude or designation for a given observable characteristic that is a number

has quantity kind
type: ObjectProperty
sub property of: isClassifiedBy
range: quantity kind
definition: indicates the class of mutually comparable quantities involved in the definition of an individual quantity or factor

has quantity value
type: ObjectProperty
range: scalar quantity value
definition: relates something (an expression, formula, etc.) to its magnitude expressed as a number together with its unit of measure (if applicable)

has quantity value range
type: ObjectProperty
sub property of: has expression
range: scalar quantity value range
definition: relates something (an expression, formula, etc.) to its magnitude expressed as range of numbers together with their unit(s) of measure (if applicable)

has upper bound
type: ObjectProperty
sub property of: has argument
sub property of: has quantity value
range: scalar quantity value
definition: specifies the quantity value that is the higher value of a pair of values representing a range

is derived from
type: ObjectProperty
definition: indicates something from which the subject is obtained or determined
example: a derived quantity is derived from a base quantity; a derived unit is derived from a base unit

is dimension of
type: ObjectProperty
sub property of: classifies
domain: quantity dimension
range: quantity kind
inverse of: has dimension
definition: indicates a measurable extent associated with a given quantity kind in some system of quantities, which may be derived, depending on the choice of base quantity

is maximum inclusive
type: DatatypeProperty
range: boolean
definition: indicates whether something, such as a measurement scale, includes the absolute maximum permissive value or not

is minimum inclusive
type: DatatypeProperty
range: boolean
definition: indicates whether something, such as a measurement scale, includes the absolute minimum permissive value or not

is value of
type: ObjectProperty
sub property of: appliesTo
domain: scalar quantity value
inverse of: has quantity value
definition: is the measure that the value represents

specializes
type: ObjectProperty
definition: indicates something whose nature is more general (broader than) the subject