AnnotatingElement
type: Class
comment: An AnnotatingElement is an Element that provides additional description of or metadata on some other Element. An AnnotatingElement is either attached to its annotatedElements by Annotation Relationships, or it implicitly annotates its owningNamespace.
subclass of: Element

Annotation
type: Class
comment: An Annotation is a Relationship between an AnnotatingElement and the Element that is annotated by that AnnotatingElement.
subclass of: Relationship

Association
type: Class
comment: An Association is a Relationship and a Classifier to enable classification of links between things (in the universe). The co-domains (types) of the associationEnd Features are the relatedTypes, as co-domain and participants (linked things) of an Association identify each other.
subclass of: Classifier
subclass of: Relationship

AssociationStructure
type: Class
comment: An AssociationStructure is an Association that is also a Structure, classifying link objects that are both links and objects. As objects, link objects can be created and destroyed, and their non-end Features can change over time. However, the values of the end Features of a link object are fixed and cannot change over its lifetime.
subclass of: Association
subclass of: Structure

Behavior
type: Class
comment: A Behavior coordinates occurrences of other Behaviors, as well as changes in objects. Behaviors can be decomposed into Steps and be characterized by parameters.
subclass of: Class

BindingConnector
type: Class
comment: A BindingConnector is a binary Connector that requires its relatedFeatures to identify the same things (have the same values).
subclass of: Connector

BooleanExpression
type: Class
comment: A BooleanExpression is a Boolean-valued Expression whose type is a Predicate. It represents a logical condition resulting from the evaluation of the Predicate.
subclass of: Expression

Class
comment: A Class is a Classifier of things (in the universe) that can be distinguished without regard to how they are related to other things (via Features). This means multiple things classified by the same Class can be distinguished, even when they are related other things in exactly the same way.
subclass of: Classifier

Classifier
type: Class
comment: A Classifier is a Type that classifies:.
subclass of: Type

CollectExpression
type: Class
comment: A CollectExpression is an OperatorExpression whose operator is "collect", which resolves to the Function ControlFunctions::collect from the Kernel Functions Library.
subclass of: OperatorExpression

Comment
type: Class
comment: A Comment is an AnnotatingElement whose body in some way describes its annotatedElements.
subclass of: AnnotatingElement

Conjugation
type: Class
comment: Conjugation is a Relationship between two types in which the conjugatedType inherits all the Features of the originalType, but with all input and output Features reversed. That is, any Features with a direction in relative to the originalType are considered to have an effective direction of out relative to the conjugatedType and, similarly, Features with direction out in the originalType are considered to have an effective direction of in in the conjugatedType. Features with direction inout, or with no direction, in the originalType, are inherited without change.
subclass of: Relationship

Connector
type: Class
comment: A Connector is a usage of Associations, with links restricted according to instances of the Type in which they are used (domain of the Connector). The associations of the Connector restrict what kinds of things might be linked. The Connector further restricts these links to be between values of Features on instances of its domain.
subclass of: Feature
subclass of: Relationship

ConstructorExpression
type: Class
comment: A ConstructorExpression is an InstantiationExpression whose result specializes its instantiatedType, binding some or all of the features of the instantiatedType to the results of its argument Expressions.
subclass of: InstantiationExpression

CrossSubsetting
type: Class
comment: CrossSubsetting is a kind of Subsetting for end Features, as identified by crossingFeature, to subset a chained Feature, identified by crossedFeature. It navigates to instances of the end Feature’s type from instances of other end Feature types on the same owningType (at least two end Features are required for any of them to have a CrossSubsetting).
subclass of: Subsetting

DataType
type: Class
comment: A DataType is a Classifier of things (in the universe) that can only be distinguished by how they are related to other things (via Features). This means multiple things classified by the same DataType.
subclass of: Classifier

Dependency
type: Class
comment: A Dependency is a Relationship that indicates that one or more client Elements require one more supplier Elements for their complete specification. In general, this means that a change to one of the supplier Elements may necessitate a change to, or re-specification of, the client Elements.
subclass of: Relationship

Differencing
type: Class
comment: Differencing is a Relationship that makes its differencingType one of the differencingTypes of its typeDifferenced.
subclass of: Relationship

Disjoining
type: Class
comment: A Disjoining is a Relationship between Types asserted to have interpretations that are not shared (disjoint) between them, identified as typeDisjoined and disjoiningType. For example, a Classifier for mammals is disjoint from a Classifier for minerals, and a Feature for people's parents is disjoint from a Feature for their children.
subclass of: Relationship

Documentation
type: Class
comment: Documentation is a Comment that specifically documents a documentedElement, which must be its owner.
subclass of: Comment

Element
type: Class
comment: An Element is a constituent of a model that is uniquely identified relative to all other Elements. It can have Relationships with other Elements. Some of these Relationships might imply ownership of other Elements, which means that if an Element is deleted from a model, then so are all the Elements that it owns.
subclass of: Resource

ElementFilterMembership
type: Class
comment: ElementFilterMembership is a Membership between a Namespace and a model-level evaluable Boolean-valued Expression, asserting that imported members of the Namespace should be filtered using the condition Expression. A general Namespace does not define any specific filtering behavior, but such behavior may be defined for various specialized kinds of Namespaces.
subclass of: OwningMembership

EndFeatureMembership
type: Class
comment: EndFeatureMembership is a FeatureMembership that requires its memberFeature be owned and have isEnd = true.
subclass of: FeatureMembership

Expression
type: Class
comment: An Expression is a Step that is typed by a Function. An Expression that also has a Function as its featuringType is a computational step within that Function. An Expression always has a single result parameter, which redefines the result parameter of its defining function. This allows Expressions to be interconnected in tree structures, in which inputs to each Expression in the tree are determined as the results of other Expression in the tree.
subclass of: Step

Feature
type: Class
comment: A Feature is a Type that classifies relations between multiple things (in the universe). The domain of the relation is the intersection of the featuringTypes of the Feature. (The domain of a Feature with no featuringTyps is implicitly the most general Type Base::Anything from the Kernel Semantic Library.) The co-domain of the relation is the intersection of the types of the Feature. .
subclass of: Type

FeatureChainExpression
type: Class
comment: A FeatureChainExpression is an OperatorExpression whose operator is ".", which resolves to the Function ControlFunctions::'.' from the Kernel Functions Library. It evaluates to the result of chaining the result Feature of its single argument Expression with its targetFeature.
subclass of: OperatorExpression

FeatureChaining
type: Class
comment: FeatureChaining is a Relationship that makes its target Feature one of the chainingFeatures of its owning Feature.
subclass of: Relationship

FeatureDirectionKind
type: Class
comment: FeatureDirectionKind enumerates the possible kinds of direction that a Feature may be given as a member of a Type.

FeatureInverting
type: Class
comment: A FeatureInverting is a Relationship between Features asserting that their interpretations (sequences) are the reverse of each other, identified as featureInverted and invertingFeature. For example, a Feature identifying each person's parents is the inverse of a Feature identifying each person's children. A person identified as a parent of another will identify that other as one of their children.
subclass of: Relationship

FeatureMembership
type: Class
comment: A FeatureMembership is an OwningMembership between an ownedMemberFeature and an owningType. If the ownedMemberFeature has isVariable = false, then the FeatureMembership implies that the owningType is also a featuringType of the ownedMemberFeature. If the ownedMemberFeature has isVariable = true, then the FeatureMembership implies that the ownedMemberFeature is featured by the snapshots of the owningType, which must specialize the Kernel Semantic Library base class Occurrence.
subclass of: OwningMembership

FeatureReferenceExpression
type: Class
comment: A FeatureReferenceExpression is an Expression whose result is bound to a referent Feature.
subclass of: Expression

FeatureTyping
type: Class
comment: FeatureTyping is Specialization in which the specific Type is a Feature. This means the set of instances of the (specific) typedFeature is a subset of the set of instances of the (general) type. In the simplest case, the type is a Classifier, whereupon the typedFeature has values that are instances of the Classifier.
subclass of: Specialization

FeatureValue
type: Class
comment: A FeatureValue is a Membership that identifies a particular member Expression that provides the value of the Feature that owns the FeatureValue. The value is specified as either a bound value or an initial value, and as either a concrete or default value. A Feature can have at most one FeatureValue.
subclass of: OwningMembership

Flow
type: Class
comment: An Flow is a Step that represents the transfer of values from one Feature to another. Flows can take non-zero time to complete.
subclass of: Connector
subclass of: Step

FlowEnd
type: Class
comment: A FlowEnd is a Feature that is one of the connectorEnds giving the source or target of a Flow. For Flows typed by FlowTransfer or its specializations, FlowEnds must have exactly one ownedFeature, which redefines Transfer::source::sourceOutput or Transfer::target::targetInput and redefines the corresponding feature of the relatedElement for its end.
subclass of: Feature

Function
type: Class
comment: A Function is a Behavior that has an out parameter that is identified as its result. A Function represents the performance of a calculation that produces the values of its result parameter. This calculation may be decomposed into Expressions that are steps of the Function.
subclass of: Behavior

Import
type: Class
comment: An Import is an Relationship between its importOwningNamespace and either a Membership (for a MembershipImport) or another Namespace (for a NamespaceImport), which determines a set of Memberships that become importedMemberships of the importOwningNamespace. If isImportAll = false (the default), then only public Memberships are considered "visible". If isImportAll = true, then all Memberships are considered "visible", regardless of their declared visibility. If isRecursive = true, then visible Memberships are also recursively imported from owned sub-Namespaces.
subclass of: Relationship

IndexExpression
type: Class
comment: An IndexExpression is an OperatorExpression whose operator is "#", which resolves to the Function BasicFunctions::'#' from the Kernel Functions Library.
subclass of: OperatorExpression

InstantiationExpression
type: Class
comment: An InstantiationExpression is an Expression that instantiates its instantiatedType, binding some or all of the features of that Type to the results of its arguments.
subclass of: Expression

Interaction
type: Class
comment: An Interaction is a Behavior that is also an Association, providing a context for multiple objects that have behaviors that impact one another.
subclass of: Association
subclass of: Behavior

Intersecting
type: Class
comment: Intersecting is a Relationship that makes its intersectingType one of the intersectingTypes of its typeIntersected.
subclass of: Relationship

Invariant
type: Class
comment: An Invariant is a BooleanExpression that is asserted to have a specific Boolean result value. If isNegated = false, then the result is asserted to be true. If isNegated = true, then the result is asserted to be false.
subclass of: BooleanExpression

InvocationExpression
type: Class
comment: An InvocationExpression is an InstantiationExpression whose instantiatedType must be a Behavior or a Feature typed by a single Behavior (such as a Step). Each of the input parameters of the instantiatedType are bound to the result of an argument Expression. If the instantiatedType is a Function or a Feature typed by a Function, then the result of the InvocationExpression is the result of the invoked Function. Otherwise, the result is an instance of the instantiatedType (essentially like a behavioral ConstructorExpression).
subclass of: InstantiationExpression

LibraryPackage
type: Class
comment: A LibraryPackage is a Package that is the container for a model library. A LibraryPackage is itself a library Element as are all Elements that are directly or indirectly contained in it.
subclass of: Package

LiteralBoolean
type: Class
comment: LiteralBoolean is a LiteralExpression that provides a Boolean value as a result. Its result parameter must have type Boolean.
subclass of: LiteralExpression

LiteralExpression
type: Class
comment: A LiteralExpression is an Expression that provides a basic DataValue as a result.
subclass of: Expression

LiteralInfinity
type: Class
comment: A LiteralInfinity is a LiteralExpression that provides the positive infinity value (*). It's result must have the type Positive.
subclass of: LiteralExpression

LiteralInteger
type: Class
comment: A LiteralInteger is a LiteralExpression that provides an Integer value as a result. Its result parameter must have the type Integer.
subclass of: LiteralExpression

LiteralRational
type: Class
comment: A LiteralRational is a LiteralExpression that provides a Rational value as a result. Its result parameter must have the type Rational.
subclass of: LiteralExpression

LiteralString
type: Class
comment: A LiteralString is a LiteralExpression that provides a String value as a result. Its result parameter must have the type String.
subclass of: LiteralExpression

Membership
type: Class
comment: A Membership is a Relationship between a Namespace and an Element that indicates the Element is a member of (i.e., is contained in) the Namespace. Any memberNames specify how the memberElement is identified in the Namespace and the visibility specifies whether or not the memberElement is publicly visible from outside the Namespace.
subclass of: Relationship

MembershipImport
type: Class
comment: A MembershipImport is an Import that imports its importedMembership into the importOwningNamespace. If isRecursive = true and the memberElement of the importedMembership is a Namespace, then the equivalent of a recursive NamespaceImport is also performed on that Namespace.
subclass of: Import

Metaclass
type: Class
comment: A Metaclass is a Structure used to type MetadataFeatures.
subclass of: Structure

MetadataAccessExpression
type: Class
comment: A MetadataAccessExpression is an Expression whose result is a sequence of instances of Metaclasses representing all the MetadataFeature annotations of the referencedElement. In addition, the sequence includes an instance of the reflective Metaclass corresponding to the MOF class of the referencedElement, with values for all the abstract syntax properties of the referencedElement.
subclass of: Expression

MetadataFeature
type: Class
comment: A MetadataFeature is a Feature that is an AnnotatingElement used to annotate another Element with metadata. It is typed by a Metaclass. All its ownedFeatures must redefine features of its metaclass and any feature bindings must be model-level evaluable.
subclass of: AnnotatingElement
subclass of: Feature

Multiplicity
type: Class
comment: A Multiplicity is a Feature whose co-domain is a set of natural numbers giving the allowed cardinalities of each typeWithMultiplicity. The cardinality of a Type is defined as follows, depending on whether the Type is a Classifier or Feature. .
subclass of: Feature

MultiplicityRange
type: Class
comment: A MultiplicityRange is a Multiplicity whose value is defined to be the (inclusive) range of natural numbers given by the result of a lowerBound Expression and the result of an upperBound Expression. The result of these Expressions shall be of type Natural. If the result of the upperBound Expression is the unbounded value *, then the specified range includes all natural numbers greater than or equal to the lowerBound value. If no lowerBound Expression, then the default is that the lower bound has the same value as the upper bound, except if the upperBound evaluates to *, in which case the default for the lower bound is 0.
subclass of: Multiplicity

Namespace
type: Class
comment: A Namespace is an Element that contains other Elements, known as its members, via Membership Relationships with those Elements. The members of a Namespace may be owned by the Namespace, aliased in the Namespace, or imported into the Namespace via Import Relationships.
subclass of: Element

NamespaceImport
type: Class
comment: A NamespaceImport is an Import that imports Memberships from its importedNamespace into the importOwningNamespace. If isRecursive = false, then only the visible Memberships of the importedNamespace are imported. If isRecursive = true, then, in addition, Memberships are recursively imported from any ownedMembers of the importedNamespace that are Namespaces.
subclass of: Import

NullExpression
type: Class
comment: A NullExpression is an Expression that results in a null value.
subclass of: Expression

OperatorExpression
type: Class
comment: An OperatorExpression is an InvocationExpression whose function is determined by resolving its operator in the context of one of the standard packages from the Kernel Function Library.
subclass of: InvocationExpression

OwningMembership
type: Class
comment: An OwningMembership is a Membership that owns its memberElement as a ownedRelatedElement. The ownedMemberElement becomes an ownedMember of the membershipOwningNamespace.
subclass of: Membership

Package
type: Class
comment: A Package is a Namespace used to group Elements, without any instance-level semantics. It may have one or more model-level evaluable filterCondition Expressions used to filter its importedMemberships. Any imported member must meet all of the filterConditions.
subclass of: Namespace

ParameterMembership
type: Class
comment: A ParameterMembership is a FeatureMembership that identifies its memberFeature as a parameter, which is always owned, and must have a direction. A ParameterMembership must be owned by a Behavior, a Step, or the result parameter of a ConstructorExpression.
subclass of: FeatureMembership

PayloadFeature
type: Class
comment: A PayloadFeature is the ownedFeature of a Flow that identifies the things carried by the kinds of transfers that are instances of the Flow.
subclass of: Feature

Predicate
type: Class
comment: A Predicate is a Function whose result parameter has type Boolean and multiplicity 1..1.
subclass of: Function

Redefinition
type: Class
comment: Redefinition is a kind of Subsetting that requires the redefinedFeature and the redefiningFeature to have the same values (on each instance of the domain of the redefiningFeature). This means any restrictions on the redefiningFeature, such as type or multiplicity, also apply to the redefinedFeature (on each instance of the domain of the redefiningFeature), and vice versa. The redefinedFeature might have values for instances of the domain of the redefiningFeature, but only as instances of the domain of the redefinedFeature that happen to also be instances of the domain of the redefiningFeature. This is supported by the constraints inherited from Subsetting on the domains of the redefiningFeature and redefinedFeature. However, these constraints are narrowed for Redefinition to require the owningTypes of the redefiningFeature and redefinedFeature to be different and the redefinedFeature to not be inherited into the owningNamespace of the redefiningFeature.This enables the redefiningFeature to have the same name as the redefinedFeature, if desired.
subclass of: Subsetting

ReferenceSubsetting
type: Class
comment: ReferenceSubsetting is a kind of Subsetting in which the referencedFeature is syntactically distinguished from other Features subsetted by the referencingFeature. ReferenceSubsetting has the same semantics as Subsetting, but the referencedFeature may have a special purpose relative to the referencingFeature. For instance, ReferenceSubsetting is used to identify the relatedFeatures of a Connector.
subclass of: Subsetting

Relationship
type: Class
comment: A Relationship is an Element that relates other Element. Some of its relatedElements may be owned, in which case those ownedRelatedElements will be deleted from a model if their owningRelationship is. A Relationship may also be owned by another Element, in which case the ownedRelatedElements of the Relationship are also considered to be transitively owned by the owningRelatedElement of the Relationship.
subclass of: Element

ResultExpressionMembership
type: Class
comment: A ResultExpressionMembership is a FeatureMembership that indicates that the ownedResultExpression provides the result values for the Function or Expression that owns it. The owning Function or Expression must contain a BindingConnector between the result parameter of the ownedResultExpression and the result parameter of the owning Function or Expression.
subclass of: FeatureMembership

ReturnParameterMembership
type: Class
comment: A ReturnParameterMembership is a ParameterMembership that indicates that the ownedMemberParameter is the result parameter of a Function or Expression. The direction of the ownedMemberParameter must be out.
subclass of: ParameterMembership

SelectExpression
type: Class
comment: A SelectExpression is an OperatorExpression whose operator is "select", which resolves to the Function ControlFunctions::select from the Kernel Functions Library.
subclass of: OperatorExpression

Specialization
type: Class
comment: Specialization is a Relationship between two Types that requires all instances of the specific type to also be instances of the general Type (i.e., the set of instances of the specific Type is a subset of those of the general Type, which might be the same set).
subclass of: Relationship

Step
type: Class
comment: A Step is a Feature that is typed by one or more Behaviors. Steps may be used by one Behavior to coordinate the performance of other Behaviors, supporting a steady refinement of behavioral descriptions. Steps can be ordered in time and can be connected using Flows to specify things flowing between their parameters.
subclass of: Feature

Structure
type: Class
comment: A Structure is a Class of objects in the modeled universe that are primarily structural in nature. While such an object is not itself behavioral, it may be involved in and acted on by Behaviors, and it may be the performer of some of them.
subclass of: Class

Subclassification
type: Class
comment: Subclassification is Specialization in which both the specific and general Types are Classifier. This means all instances of the specific Classifier are also instances of the general Classifier.
subclass of: Specialization

Subsetting
type: Class
comment: Subsetting is Specialization in which the specific and general Types are Features. This means all values of the subsettingFeature (on instances of its domain, i.e., the intersection of its featuringTypes) are values of the subsettedFeature on instances of its domain. To support this the domain of the subsettingFeature must be the same or specialize (at least indirectly) the domain of the subsettedFeature (via Specialization), and the co-domain (intersection of the types) of the subsettingFeature must specialize the co-domain of the subsettedFeature.
subclass of: Specialization

Succession
type: Class
comment: A Succession is a binary Connector that requires its relatedFeatures to happen separately in time.
subclass of: Connector

SuccessionFlow
type: Class
comment: A SuccessionFlow is a Flow that also provides temporal ordering. It classifies Transfers that cannot start until the source Occurrence has completed and that must complete before the target Occurrence can start.
subclass of: Flow
subclass of: Succession

TextualRepresentation
type: Class
comment: A TextualRepresentation is an AnnotatingElement whose body represents the representedElement in a given language. The representedElement must be the owner of the TextualRepresentation. The named language can be a natural language, in which case the body is an informal representation, or an artificial language, in which case the body is expected to be a formal, machine-parsable representation.
subclass of: AnnotatingElement

Type
type: Class
comment: A Type is a Namespace that is the most general kind of Element supporting the semantics of classification. A Type may be a Classifier or a Feature, defining conditions on what is classified by the Type (see also the description of isSufficient).
subclass of: Namespace

TypeFeaturing
type: Class
comment: A TypeFeaturing is a Featuring Relationship in which the featureOfType is the source and the featuringType is the target.
subclass of: Relationship

Unioning
type: Class
comment: Unioning is a Relationship that makes its unioningType one of the unioningTypes of its typeUnioned.
subclass of: Relationship

VisibilityKind
type: Class
comment: VisibilityKind is an enumeration whose literals specify the visibility of a Membership of an Element in a Namespace outside of that Namespace. Note that "visibility" specifically restricts whether an Element in a Namespace may be referenced by name from outside the Namespace and only otherwise restricts access to an Element as provided by specific constraints in the abstract syntax (e.g., preventing the import or inheritance of private Elements).

aliasIds
type: Property
comment: Element: Various alternative identifiers for this Element. Generally, these will be set by tools.

annotatedElement
type: Property
comment: AnnotatingElement: The Elements that are annotated by this AnnotatingElement. If annotation is not empty, these are the annotatedElements of the annotations. If annotation is empty, then it is the owningNamespace of the AnnotatingElement. Annotation: The Element that is annotated by the annotatingElement of this Annotation.

annotatingElement
type: Property
comment: Annotation: The AnnotatingElement that annotates the annotatedElement of this Annotation. This is always either the ownedAnnotatingElement or the owningAnnotatingElement.

annotation
type: Property
comment: AnnotatingElement: The Annotations that relate this AnnotatingElement to its annotatedElements. This includes the owningAnnotatingRelationship (if any) followed by all the ownedAnnotatingRelationshps.

argument
type: Property
comment: InstantiationExpression: The Expressions whose results are bound to features of the instantiatedType. The arguments are ordered consistent with the order of the features, though they may not be one-to-one with all the features.

association
type: Property
comment: Connector: The Associations that type the Connector.

associationEnd
type: Property
comment: Association: The features of the Association that identify the things that can be related by it. A concrete Association must have at least two associationEnds. When it has exactly two, the Association is called a binary Association.

behavior
type: Property
comment: Step: The Behaviors that type this Step.

body
type: Property
comment: Comment: The annotation text for the Comment. TextualRepresentation: The textual representation of the representedElement in the given language.

bound
type: Property
comment: MultiplicityRange: The owned Expressions of the MultiplicityRange whose results provide its bounds. These must be the first ownedMembers of the MultiplicityRange.

chainingFeature
type: Property
comment: Feature: The Feature that are chained together to determine the values of this Feature, derived from the chainingFeatures of the ownedFeatureChainings of this Feature, in the same order. The values of a Feature with chainingFeatures are the same as values of the last Feature in the chain, which can be found by starting with the values of the first Feature (for each instance of the domain of the original Feature), then using each of those as domain instances to find the values of the second Feature in chainingFeatures, and so on, to values of the last Feature. FeatureChaining: The Feature whose values partly determine values of featureChained, as described in Feature::chainingFeature.

client
type: Property
comment: Dependency: The Element or Elements dependent on the supplier Elements.

condition
type: Property
comment: ElementFilterMembership: The model-level evaluable Boolean-valued Expression used to filter the imported members of the membershipOwningNamespace of this ElementFilterMembership.

conjugatedType
type: Property
comment: Conjugation: The Type that is the result of applying Conjugation to the originalType.

connectorEnd
type: Property
comment: Connector: The endFeatures of a Connector, which redefine the endFeatures of the associations of the Connector. The connectorEnds determine via ReferenceSubsetting Relationships which Features are related by the Connector.

crossFeature
type: Property
comment: Feature: The second chainingFeature of the crossedFeature of the ownedCrossSubsetting of this Feature, if it has one. Semantically, the values of the crossFeature of an end Feature must include all values of the end Feature obtained when navigating from values of the other end Features of the same owningType. .

crossedFeature
type: Property
comment: CrossSubsetting: The chained Feature that is cross subset by the crossingFeature of this CrossSubsetting.

crossingFeature
type: Property
comment: CrossSubsetting: The end Feature that owns this CrossSubsetting relationship and is also its subsettingFeature.

declaredName
type: Property
comment: Element: The declared name of this Element.

declaredShortName
type: Property
comment: Element: An optional alternative name for the Element that is intended to be shorter or in some way more succinct than its primary name. It may act as a modeler-specified identifier for the Element, though it is then the responsibility of the modeler to maintain the uniqueness of this identifier within a model or relative to some other context.

defaultFeaturingType
type: Property
comment: Connector: The innermost Type that is a common direct or indirect featuringType of the relatedFeatures, such that, if it exists and was the featuringType of this Connector, the Connector would satisfy the checkConnectorTypeFeaturing constraint.

differencingType
type: Property
comment: Type: The interpretations of a Type with differencingTypes are asserted to be those of the first of those Types, but not including those of the remaining Types. For example, a Classifier might be the difference of a Classifier for people and another for people of a particular nationality, leaving people who are not of that nationality. Similarly, a feature of people might be the difference between a feature for their children and a Classifier for people of a particular sex, identifying their children not of that sex (because the interpretations of the children Feature that identify those of that sex are also interpretations of the Classifier for that sex). Differencing: Type that partly determines interpretations of typeDifferenced, as described in Type::differencingType.

directedFeature
type: Property
comment: Type: The features of this Type that have a non-null direction.

direction
type: Property
comment: Feature: Indicates how values of this Feature are determined or used (as specified for the FeatureDirectionKind).

disjoiningType
type: Property
comment: Disjoining: Type asserted to be disjoint with the typeDisjoined.

documentation
type: Property
comment: Element: The Documentation owned by this Element.

documentedElement
type: Property
comment: Documentation: The Element that is documented by this Documentation.

elementId
type: Property
comment: Element: The globally unique identifier for this Element. This is intended to be set by tooling, and it must not change during the lifetime of the Element.

endFeature
type: Property
comment: Type: All features of this Type with isEnd = true.

endOwningType
type: Property
comment: Feature: The Type that is related to this Feature by an EndFeatureMembership in which the Feature is an ownedMemberFeature.

expression
type: Property
comment: Function: The Expressions that are steps in the calculation of the result of this Function.

feature
type: Property
comment: Type: The ownedMemberFeatures of the featureMemberships of this Type.

featureChained
type: Property
comment: FeatureChaining: The Feature whose values are partly determined by values of the chainingFeature, as described in Feature::chainingFeature.

featureInverted
type: Property
comment: FeatureInverting: The Feature that is an inverse of the invertingFeature.

featureMembership
type: Property
comment: Type: The FeatureMemberships for features of this Type, which include all ownedFeatureMemberships and those inheritedMemberships that are FeatureMemberships (but does not include any importedMemberships).

featureOfType
type: Property
comment: TypeFeaturing: The Feature that is featured by the featuringType. It is the source of the TypeFeaturing.

featureTarget
type: Property
comment: Feature: The last of the chainingFeatures of this Feature, if it has any. Otherwise, this Feature itself.

featureWithValue
type: Property
comment: FeatureValue: The Feature to be provided a value.

featuringType
type: Property
comment: Feature: Types that feature this Feature, such that any instance in the domain of the Feature must be classified by all of these Types, including at least all the featuringTypes of its typeFeaturings. If the Feature is chained, then the featuringTypes of the first Feature in the chain are also featuringTypes of the chained Feature. TypeFeaturing: The Type that features the featureOfType. It is the target of the TypeFeaturing.

filterCondition
type: Property
comment: Package: The model-level evaluable Boolean-valued Expression used to filter the members of this Package, which are owned by the Package are via ElementFilterMemberships.

flowEnd
type: Property
comment: Flow: The connectorEnds of this Flow that are FlowEnds.

function
type: Property
comment: Expression: The Function that types this Expression.

general
type: Property
comment: Specialization: A Type with a superset of all instances of the specific Type, which might be the same set.

importOwningNamespace
type: Property
comment: Import: The Namespace into which Memberships are imported by this Import, which must be the owningRelatedElement of the Import.

importedElement
type: Property
comment: Import: The effectively imported Element for this Import. For a MembershipImport, this is the memberElement of the importedMembership. For a NamespaceImport, it is the importedNamespace.

importedMembership
type: Property
comment: Namespace: The Memberships in this Namespace that result from the ownedImports of this Namespace. MembershipImport: The Membership to be imported.

importedNamespace
type: Property
comment: NamespaceImport: The Namespace whose visible Memberships are imported by this NamespaceImport.

in
type: FeatureDirectionKind
comment: Values of the Feature on each instance of its domain are determined externally to that instance and used internally.

inheritedFeature
type: Property
comment: Type: All the memberFeatures of the inheritedMemberships of this Type that are FeatureMemberships.

inheritedMembership
type: Property
comment: Type: All Memberships inherited by this Type via Specialization or Conjugation. These are included in the derived union for the memberships of the Type.

inout
type: FeatureDirectionKind
comment: Values of the Feature on each instance are determined either as in or out directions, or both.

input
type: Property
comment: Type: All features related to this Type by FeatureMemberships that have direction in or inout.

instantiatedType
type: Property
comment: InstantiationExpression: The Type that is being instantiated.

interaction
type: Property
comment: Flow: The Interactions that type this Flow. Interactions are both Associations and Behaviors, which can type Connectors and Steps, respectively.

intersectingType
type: Property
comment: Type: The interpretations of a Type with intersectingTypes are asserted to be those in common among the intersectingTypes, which are the Types derived from the intersectingType of the ownedIntersectings of this Type. For example, a Classifier might be an intersection of Classifiers for people of a particular sex and of a particular nationality. Similarly, a feature for people's children of a particular sex might be the intersection of a Feature for their children and a Classifier for people of that sex (because the interpretations of the children Feature that identify those of that sex are also interpretations of the Classifier for that sex). Intersecting: Type that partly determines interpretations of typeIntersected, as described in Type::intersectingType.

invertingFeature
type: Property
comment: FeatureInverting: The Feature that is an inverse of the invertedFeature.

isAbstract
type: Property
comment: Type: Indicates whether instances of this Type must also be instances of at least one of its specialized Types.

isComposite
type: Property
comment: Feature: Whether the Feature is a composite feature of its featuringType. If so, the values of the Feature cannot exist after its featuring instance no longer does and cannot be values of another composite feature that is not on the same featuring instance.

isConjugated
type: Property
comment: Type: Indicates whether this Type has an ownedConjugator.

isConstant
type: Property
comment: Feature: If isVariable is true, then whether the value of this Feature nevertheless does not change over all snapshots of its owningType.

isDefault
type: Property
comment: FeatureValue: Whether this FeatureValue is a concrete specification of the bound or initial value of the featureWithValue, or just a default value that may be overridden.

isDerived
type: Property
comment: Feature: Whether the values of this Feature can always be computed from the values of other Features.

isEnd
type: Property
comment: Feature: Whether or not this Feature is an end Feature. An end Feature always has multiplicity 1, mapping each of its domain instances to a single co-domain instance. However, it may have a crossFeature, in which case values of the crossFeature must be the same as those found by navigation across instances of the owningType from values of other end Features to values of this Feature. If the owningType has n end Features, then the multiplicity, ordering, and uniqueness declared for the crossFeature of any one of these end Features constrains the cardinality, ordering, and uniqueness of the collection of values of that Feature reached by navigation when the values of the other n-1 end Features are held fixed.

isImplied
type: Property
comment: Relationship: Whether this Relationship was generated by tooling to meet semantic rules, rather than being directly created by a modeler.

isImpliedIncluded
type: Property
comment: Element: Whether all necessary implied Relationships have been included in the ownedRelationships of this Element. This property may be true, even if there are not actually any ownedRelationships with isImplied = true, meaning that no such Relationships are actually implied for this Element. However, if it is false, then ownedRelationships may not contain any implied Relationships. That is, either all required implied Relationships must be included, or none of them.

isImportAll
type: Property
comment: Import: Whether to import memberships without regard to declared visibility.

isInitial
type: Property
comment: FeatureValue: Whether this FeatureValue specifies a bound value or an initial value for the featureWithValue.

isLibraryElement
type: Property
comment: Element: Whether this Element is contained in the ownership tree of a library model.

isModelLevelEvaluable
type: Property
comment: Expression: Whether this Expression meets the constraints necessary to be evaluated at model level, that is, using metadata within the model. Function: Whether this Function can be used as the function of a model-level evaluable InvocationExpression. Certain Functions from the Kernel Functions Library are considered to have isModelLevelEvaluable = true. For all other Functions it is false.

isNegated
type: Property
comment: Invariant: Whether this Invariant is asserted to be false rather than true.

isOrdered
type: Property
comment: Feature: Whether an order exists for the values of this Feature or not.

isPortion
type: Property
comment: Feature: Whether the values of this Feature are contained in the space and time of instances of the domain of the Feature and represent the same thing as those instances.

isRecursive
type: Property
comment: Import: Whether to recursively import Memberships from visible, owned sub-Namespaces.

isStandard
type: Property
comment: LibraryPackage: Whether this LibraryPackage contains a standard library model. This should only be set to true for LibraryPackages in the standard Kernel Model Libraries or in normative model libraries for a language built on KerML.

isSufficient
type: Property
comment: Type: Whether all things that meet the classification conditions of this Type must be classified by the Type.

isUnique
type: Property
comment: Feature: Whether or not values for this Feature must have no duplicates or not.

isVariable
type: Property
comment: Feature: Whether the value of this Feature might vary over time. That is, whether the Feature may have a different value for each snapshot of an owningType that is an Occurrence.

language
type: Property
comment: TextualRepresentation: The natural or artifical language in which the body text is written.

locale
type: Property
comment: Comment: Identification of the language of the body text and, optionally, the region and/or encoding. The format shall be a POSIX locale conformant to ISO/IEC 15897, with the format [language[_territory][.codeset][@modifier]].

lowerBound
type: Property
comment: MultiplicityRange: The Expression whose result provides the lower bound of the MultiplicityRange. If no lowerBound Expression is given, then the lower bound shall have the same value as the upper bound, unless the upper bound is unbounded (*), in which case the lower bound shall be 0.

member
type: Property
comment: Namespace: The set of all member Elements of this Namespace, which are the memberElements of all memberships of the Namespace.

memberElement
type: Property
comment: Membership: The Element that becomes a member of the membershipOwningNamespace due to this Membership.

memberElementId
type: Property
comment: Membership: The elementId of the memberElement.

memberName
type: Property
comment: Membership: The name of the memberElement relative to the membershipOwningNamespace.

memberShortName
type: Property
comment: Membership: The short name of the memberElement relative to the membershipOwningNamespace.

membership
type: Property
comment: Namespace: All Memberships in this Namespace, including (at least) the union of ownedMemberships and importedMemberships.

membershipOwningNamespace
type: Property
comment: Membership: The Namespace of which the memberElement becomes a member due to this Membership.

metaclass
type: Property
comment: MetadataFeature: The type of this MetadataFeature, which must be a Metaclass.

multiplicity
type: Property
comment: Type: An ownedMember of this Type that is a Multiplicity, which constraints the cardinality of the Type. If there is no such ownedMember, then the cardinality of this Type is constrained by all the Multiplicity constraints applicable to any direct supertypes.

name
type: Property
comment: Element: The name to be used for this Element during name resolution within its owningNamespace. This is derived using the effectiveName() operation. By default, it is the same as the declaredName, but this is overridden for certain kinds of Elements to compute a name even when the declaredName is null.

operator
type: Property
comment: OperatorExpression: An operator symbol that names a corresponding Function from one of the standard packages from the Kernel Function Library .

originalType
type: Property
comment: Conjugation: The Type to be conjugated.

out
type: FeatureDirectionKind
comment: Values of the Feature on each instance of its domain are determined internally to that instance and used externally.

output
type: Property
comment: Type: All features related to this Type by FeatureMemberships that have direction out or inout.

ownedAnnotatingElement
type: Property
comment: Annotation: The annotatingElement of this Annotation, when it is an ownedRelatedElement.

ownedAnnotatingRelationship
type: Property
comment: AnnotatingElement: The ownedRelationships of this AnnotatingElement that are Annotations, for which this AnnotatingElement is the annotatingElement.

ownedAnnotation
type: Property
comment: Element: The ownedRelationships of this Element that are Annotations, for which this Element is the annotatedElement.

ownedConjugator
type: Property
comment: Type: A Conjugation owned by this Type for which the Type is the originalType.

ownedCrossSubsetting
type: Property
comment: Feature: The one ownedSubsetting of this Feature, if any, that is a CrossSubsetting}, for which the Feature is the crossingFeature.

ownedDifferencing
type: Property
comment: Type: The ownedRelationships of this Type that are Differencings, having this Type as their typeDifferenced.

ownedDisjoining
type: Property
comment: Type: The ownedRelationships of this Type that are Disjoinings, for which the Type is the typeDisjoined Type.

ownedElement
type: Property
comment: Element: The Elements owned by this Element, derived as the ownedRelatedElements of the ownedRelationships of this Element.

ownedEndFeature
type: Property
comment: Type: All endFeatures of this Type that are ownedFeatures.

ownedFeature
type: Property
comment: Type: The ownedMemberFeatures of the ownedFeatureMemberships of this Type.

ownedFeatureChaining
type: Property
comment: Feature: The ownedRelationships of this Feature that are FeatureChainings, for which the Feature will be the featureChained.

ownedFeatureInverting
type: Property
comment: Feature: The ownedRelationships of this Feature that are FeatureInvertings and for which the Feature is the featureInverted.

ownedFeatureMembership
type: Property
comment: Type: The ownedMemberships of this Type that are FeatureMemberships, for which the Type is the owningType. Each such FeatureMembership identifies an ownedFeature of the Type.

ownedImport
type: Property
comment: Namespace: The ownedRelationships of this Namespace that are Imports, for which the Namespace is the importOwningNamespace.

ownedIntersecting
type: Property
comment: Type: The ownedRelationships of this Type that are Intersectings, have the Type as their typeIntersected.

ownedMember
type: Property
comment: Namespace: The owned members of this Namespace, which are the ownedMemberElements of the ownedMemberships of the Namespace.

ownedMemberElement
type: Property
comment: OwningMembership: The Element that becomes an ownedMember of the membershipOwningNamespace due to this OwningMembership.

ownedMemberElementId
type: Property
comment: OwningMembership: The elementId of the ownedMemberElement.

ownedMemberFeature
type: Property
comment: FeatureMembership: The Feature that this FeatureMembership relates to its owningType, making it an ownedFeature of the owningType.

ownedMemberName
type: Property
comment: OwningMembership: The name of the ownedMemberElement.

ownedMemberParameter
type: Property
comment: ParameterMembership: The Feature that is identified as a parameter by this ParameterMembership.

ownedMemberShortName
type: Property
comment: OwningMembership: The shortName of the ownedMemberElement.

ownedMembership
type: Property
comment: Namespace: The ownedRelationships of this Namespace that are Memberships, for which the Namespace is the membershipOwningNamespace.

ownedRedefinition
type: Property
comment: Feature: The ownedSubsettings of this Feature that are Redefinitions, for which the Feature is the redefiningFeature.

ownedReferenceSubsetting
type: Property
comment: Feature: The one ownedSubsetting of this Feature, if any, that is a ReferenceSubsetting, for which the Feature is the referencingFeature.

ownedRelatedElement
type: Property
comment: Relationship: The relatedElements of this Relationship that are owned by the Relationship.

ownedRelationship
type: Property
comment: Element: The Relationships for which this Element is the owningRelatedElement.

ownedResultExpression
type: Property
comment: ResultExpressionMembership: The Expression that provides the result for the owner of the ResultExpressionMembership.

ownedSpecialization
type: Property
comment: Type: The ownedRelationships of this Type that are Specializations, for which the Type is the specific Type.

ownedSubclassification
type: Property
comment: Classifier: The ownedSpecializations of this Classifier that are Subclassifications, for which this Classifier is the subclassifier.

ownedSubsetting
type: Property
comment: Feature: The ownedSpecializations of this Feature that are Subsettings, for which the Feature is the subsettingFeature.

ownedTypeFeaturing
type: Property
comment: Feature: The ownedRelationships of this Feature that are TypeFeaturings and for which the Feature is the featureOfType.

ownedTyping
type: Property
comment: Feature: The ownedSpecializations of this Feature that are FeatureTypings, for which the Feature is the typedFeature.

ownedUnioning
type: Property
comment: Type: The ownedRelationships of this Type that are Unionings, having the Type as their typeUnioned.

owner
type: Property
comment: Element: The owner of this Element, derived as the owningRelatedElement of the owningRelationship of this Element, if any.

owningAnnotatedElement
type: Property
comment: Annotation: The annotatedElement of this Annotation, when it is also the owningRelatedElement.

owningAnnotatingElement
type: Property
comment: Annotation: The annotatingElement of this Annotation, when it is the owningRelatedElement.

owningAnnotatingRelationship
type: Property
comment: AnnotatingElement: The owningRelationship of this AnnotatingRelationship, if it is an Annotation.

owningClassifier
type: Property
comment: Subclassification: The Classifier that owns this Subclassification relationship, which must also be its subclassifier.

owningFeature
type: Property
comment: Subsetting: A subsettingFeature that is also the owningRelatedElement of this Subsetting. FeatureTyping: A typedFeature that is also the owningRelatedElement of this FeatureTyping. FeatureInverting: A featureInverted that is also the owningRelatedElement of this FeatureInverting.

owningFeatureMembership
type: Property
comment: Feature: The FeatureMembership that owns this Feature as an ownedMemberFeature, determining its owningType.

owningFeatureOfType
type: Property
comment: TypeFeaturing: A featureOfType that is also the owningRelatedElement of this TypeFeaturing.

owningMembership
type: Property
comment: Element: The owningRelationship of this Element, if that Relationship is a Membership.

owningNamespace
type: Property
comment: Element: The Namespace that owns this Element, which is the membershipOwningNamespace of the owningMembership of this Element, if any.

owningRelatedElement
type: Property
comment: Relationship: The relatedElement of this Relationship that owns the Relationship, if any.

owningRelationship
type: Property
comment: Element: The Relationship for which this Element is an ownedRelatedElement, if any.

owningType
type: Property
comment: Specialization: The Type that is the specific Type of this Specialization and owns it as its owningRelatedElement. FeatureMembership: The Type that owns this FeatureMembership. Feature: The Type that is the owningType of the owningFeatureMembership of this Feature. Conjugation: The conjugatedType of this Conjugation that is also its owningRelatedElement. Disjoining: A typeDisjoined that is also an owningRelatedElement.

parameter
type: Property
comment: Behavior: The parameters of this Behavior, which are defined as its directedFeatures, whose values are passed into and/or out of a performance of the Behavior. Step: The parameters of this Step, which are defined as its directedFeatures, whose values are passed into and/or out of a performance of the Step.

payloadFeature
type: Property
comment: Flow: The ownedFeature of the Flow that is a PayloadFeature (if any).

payloadType
type: Property
comment: Flow: The type of values transferred, which is the type of the payloadFeature of the Flow.

predicate
type: Property
comment: BooleanExpression: The Predicate that types the Expression.

private
type: VisibilityKind
comment: Indicates a Membership is not visible outside its owning Namespace.

protected
type: VisibilityKind
comment: An intermediate level of visibility between public and private. By default, it is equivalent to private for the purposes of normal access to and import of Elements from a Namespace. However, other Relationships may be specified to include Memberships with protected visibility in the list of memberships for a Namespace (e.g., Specialization).

public
type: VisibilityKind
comment: Indicates that a Membership is publicly visible outside its owning Namespace.

qualifiedName
type: Property
comment: Element: The full ownership-qualified name of this Element, represented in a form that is valid according to the KerML textual concrete syntax for qualified names (including use of unrestricted name notation and escaped characters, as necessary). The qualifiedName is null if this Element has no owningNamespace or if there is not a complete ownership chain of named Namespaces from a root Namespace to this Element. If the owningNamespace has other Elements with the same name as this one, then the qualifiedName is null for all such Elements other than the first.

redefinedFeature
type: Property
comment: Redefinition: The Feature that is redefined by the redefiningFeature of this Redefinition.

redefiningFeature
type: Property
comment: Redefinition: The Feature that is redefining the redefinedFeature of this Redefinition.

referencedElement
type: Property
comment: MetadataAccessExpression: The Element whose metadata is being accessed.

referencedFeature
type: Property
comment: ReferenceSubsetting: The Feature that is referenced by the referencingFeature of this ReferenceSubsetting.

referencingFeature
type: Property
comment: ReferenceSubsetting: The Feature that owns this ReferenceSubsetting relationship, which is also its subsettingFeature.

referent
type: Property
comment: FeatureReferenceExpression: The Feature that is referenced by this FeatureReferenceExpression, which is its first non-parameter member.

relatedElement
type: Property
comment: Relationship: The Elements that are related by this Relationship, derived as the union of the source and target Elements of the Relationship.

relatedFeature
type: Property
comment: Connector: The Features that are related by this Connector considered as a Relationship and that restrict the links it identifies, given by the referenced Features of the connectorEnds of the Connector.

relatedType
type: Property
comment: Association: The types of the associationEnds of the Association, which are the relatedElements of the Association considered as a Relationship.

representedElement
type: Property
comment: TextualRepresentation: The Element that is represented by this TextualRepresentation.

result
type: Property
comment: Expression: result. Function: The object or value that is the result of evaluating the Function.

shortName
type: Property
comment: Element: The short name to be used for this Element during name resolution within its owningNamespace. This is derived using the effectiveShortName() operation. By default, it is the same as the declaredShortName, but this is overridden for certain kinds of Elements to compute a shortName even when the declaredName is null.

source
type: Property
comment: Relationship: The relatedElements from which this Relationship is considered to be directed.

sourceFeature
type: Property
comment: Connector: The source relatedFeature for this Connector. It is the first relatedFeature.

sourceOutputFeature
type: Property
comment: Flow: The Feature that provides the items carried by the Flow. It must be a feature of the source of the Flow.

sourceType
type: Property
comment: Association: The source relatedType for this Association. It is the first relatedType of the Association.

specific
type: Property
comment: Specialization: A Type with a subset of all instances of the general Type, which might be the same set.

step
type: Property
comment: Behavior: The Steps that make up this Behavior.

subclassifier
type: Property
comment: Subclassification: The more specific Classifier in this Subclassification.

subsettedFeature
type: Property
comment: Subsetting: The Feature that is subsetted by the subsettingFeature of this Subsetting.

subsettingFeature
type: Property
comment: Subsetting: The Feature that is a subset of the subsettedFeature of this Subsetting.

superclassifier
type: Property
comment: Subclassification: The more general Classifier in this Subclassification.

supplier
type: Property
comment: Dependency: The Element or Elements on which the client Elements depend in some respect.

target
type: Property
comment: Relationship: The relatedElements to which this Relationship is considered to be directed.

targetFeature
type: Property
comment: Connector: The target relatedFeatures for this Connector. This includes all the relatedFeatures other than the sourceFeature. FeatureChainExpression: The Feature that is accessed by this FeatureChainExpression, which is its first non-parameter member.

targetInputFeature
type: Property
comment: Flow: The Feature that receives the values carried by the Flow. It must be a feature of the target of the Flow.

targetType
type: Property
comment: Association: The target relatedTypes for this Association. This includes all the relatedTypes other than the sourceType.

textualRepresentation
type: Property
comment: Element: The TextualRepresentations that annotate this Element.

type
type: Property
comment: Feature: Types that restrict the values of this Feature, such that the values must be instances of all the types. The types of a Feature are derived from its typings and the types of its subsettings. If the Feature is chained, then the types of the last Feature in the chain are also types of the chained Feature. FeatureTyping: The Type that is being applied by this FeatureTyping.

typeDifferenced
type: Property
comment: Differencing: Type with interpretations partly determined by differencingType, as described in Type::differencingType.

typeDisjoined
type: Property
comment: Disjoining: Type asserted to be disjoint with the disjoiningType.

typeIntersected
type: Property
comment: Intersecting: Type with interpretations partly determined by intersectingType, as described in Type::intersectingType.

typeUnioned
type: Property
comment: Unioning: Type with interpretations partly determined by unioningType, as described in Type::unioningType.

typedFeature
type: Property
comment: FeatureTyping: The Feature that has a type determined by this FeatureTyping.

unioningType
type: Property
comment: Type: The interpretations of a Type with unioningTypes are asserted to be the same as those of all the unioningTypes together, which are the Types derived from the unioningType of the ownedUnionings of this Type. For example, a Classifier for people might be the union of Classifiers for all the sexes. Similarly, a feature for people's children might be the union of features dividing them in the same ways as people in general. Unioning: Type that partly determines interpretations of typeUnioned, as described in Type::unioningType.

upperBound
type: Property
comment: MultiplicityRange: The Expression whose result is the upper bound of the MultiplicityRange.

value
type: Property
comment: FeatureValue: The Expression that provides the value as a result. LiteralBoolean: The Boolean value that is the result of evaluating this LiteralBoolean. LiteralInteger: The Integer value that is the result of evaluating this LiteralInteger. LiteralString: The String value that is the result of evaluating this Expression. LiteralRational: The value whose rational approximation is the result of evaluating this LiteralRational.

visibility
type: Property
comment: Membership: Whether or not the Membership of the memberElement in the membershipOwningNamespace is publicly visible outside that Namespace. Import: The visibility level of the imported members from this Import relative to the importOwningNamespace. The default is private.

OSLC KerML Vocabulary
type: Ontology
description: All vocabulary URIs defined in the OSLC KerML namespace.
has version: V2
is part of: KerML
issued: 2025-02-01
publisher: www.omg.org
source: KerML-vocab.ttl
preferred namespace prefix: oslc_kerml